BDBM50514302 CHEMBL4452527
SMILES [H][C@]12CC[C@H](N1C(=O)[C@H](CN(CC2)C(=O)CCCCCC#Cc1cccc2C(=O)N(Cc12)C1CCC(=O)NC1=O)NC(=O)c1cc2cc(ccc2[nH]1)C(F)(F)P(O)(O)=O)C(=O)N[C@@H](CCC(N)=O)C(=O)NC(c1ccccc1)c1ccccc1
InChI Key InChIKey=JKCSCHXVWPSGBG-OPKPGBGESA-N
Data  1 KI  6 Kd
  Tab Delimited (TSV)   2D SDfile   Computed 3D by Vconf -m prep SDfile
Find this compound or compounds like it in BindingDB:
Activity Spreadsheet -- Enzyme Inhibition Constant Data from BindingDB
Found 7 hits for monomerid = 50514302
TargetSignal transducer and activator of transcription 3(Homo sapiens (Human))
University Of Michigan
Curated by ChEMBL
LigandPNGBDBM50514302(CHEMBL4452527)
Affinity DataKi:  12nM. Assay description: Binding affinity to recombinant STAT3 (unknown origin) assessed as inhibition constant incubated for 1 hr by fluorescence polarization assay
In DepthDetails ArticlePubMed
LigandPNGBDBM50514302(CHEMBL4452527)
Affinity DataKd:  1.00E+3nM. Assay description: Binding affinity to recombinant human His/SUMO-tagged STAT1 (132 to 713 residues) expressed in Escherichia coli Rosetta (DE3) incubated for 1 hr by f...
In DepthDetails ArticlePubMed
LigandPNGBDBM50514302(CHEMBL4452527)
Affinity DataKd:  1.00E+3nM. Assay description: Binding affinity to recombinant human His/SUMO-tagged STAT4 (133 to 705 residues) expressed in Escherichia coli Rosetta (DE3) incubated for 1 hr by f...
In DepthDetails ArticlePubMed
LigandPNGBDBM50514302(CHEMBL4452527)
Affinity DataKd:  1.00E+3nM. Assay description: Binding affinity to His-MBP-tagged human STAT4 (133 to 705 residues) expressed in Escherichia coli Rosette (DE3) assessed as dissociation constant us...
In DepthDetails PubMed
TargetSignal transducer and activator of transcription 3(Homo sapiens (Human))
University Of Michigan
Curated by ChEMBL
LigandPNGBDBM50514302(CHEMBL4452527)
Affinity DataKd:  44nM. Assay description: Binding affinity to His-SUMO-tagged human STAT3 (127 to 688 residues) expressed in Escherichia coli Rosette (DE3) assessed as dissociation constant u...
In DepthDetails PubMed
LigandPNGBDBM50514302(CHEMBL4452527)
Affinity DataKd:  1.00E+3nM. Assay description: Binding affinity to His-tagged human STAT1 (132 to 713 residues) expressed in Escherichia coli Rosette (DE3) assessed as dissociation constant using ...
In DepthDetails PubMed
TargetSignal transducer and activator of transcription 3(Homo sapiens (Human))
University Of Michigan
Curated by ChEMBL
LigandPNGBDBM50514302(CHEMBL4452527)
Affinity DataKd:  44nM. Assay description: Binding affinity to recombinant human His/SUMO-tagged STAT3 (127 to 688 residues) expressed in Escherichia coli Rosetta (DE3) incubated for 1 hr by f...
In DepthDetails ArticlePubMed