BDBM506774 US11046651, Compound 2
SMILES CC(C)c1ccc2c(Oc3cc(Cl)ccc3N=C2N2CCN(CC(C)(C)C(O)=O)CC2)c1
InChI Key InChIKey=HBMJSEBYZIMZIK-UHFFFAOYSA-N
Data  2 KI
  Tab Delimited (TSV)   2D SDfile   Computed 3D by Vconf -m prep SDfile
Find this compound or compounds like it in BindingDB:
Activity Spreadsheet -- Enzyme Inhibition Constant Data from BindingDB
Found 2 hits for monomerid = 506774
Target5-hydroxytryptamine receptor 2A(Homo sapiens (Human))
Alairion
US Patent
LigandPNGBDBM506774(US11046651, Compound 2)
Affinity DataKi:  13nM. Assay description: 1 μl of a compounds of the present disclosure and either reference compound (Table C) were transferred to assay plates. 1 μl of 0.2 mM Keta...
Ligand InfoPC cidPC sid
In DepthDetails US Patent
TargetHistamine H1 receptor(Homo sapiens (Human))
Alairion
US Patent
LigandPNGBDBM506774(US11046651, Compound 2)
Affinity DataKi:  37.5nM. Assay description: 1 μl of a compounds of the present disclosure and either reference compound (Table C) were transferred to assay plates. 1 μl of 0.2 mM Keta...
Ligand InfoPC cidPC sid
In DepthDetails US Patent