BDBM506790 US11046651, Compound 10
SMILES OC(=O)C1(CN2CCN(CC2)C2=Nc3ccc(F)cc3Oc3cc(F)ccc23)CC1
InChI Key InChIKey=XVPCNLFLONEJBF-UHFFFAOYSA-N
Data  2 KI
  Tab Delimited (TSV)   2D SDfile   Computed 3D by Vconf -m prep SDfile
Find this compound or compounds like it in BindingDB:
Activity Spreadsheet -- Enzyme Inhibition Constant Data from BindingDB
Found 2 hits for monomerid = 506790
Target5-hydroxytryptamine receptor 2A(Homo sapiens (Human))
Alairion
US Patent
LigandPNGBDBM506790(US11046651, Compound 10)
Affinity DataKi:  13nM. Assay description: 1 μl of a compounds of the present disclosure and either reference compound (Table C) were transferred to assay plates. 1 μl of 0.2 mM Keta...
Ligand InfoPC cidPC sid
In DepthDetails US Patent
TargetHistamine H1 receptor(Homo sapiens (Human))
Alairion
US Patent
LigandPNGBDBM506790(US11046651, Compound 10)
Affinity DataKi:  13nM. Assay description: 1 μl of a compounds of the present disclosure and either reference compound (Table C) were transferred to assay plates. 1 μl of 0.2 mM Keta...
Ligand InfoPC cidPC sid
In DepthDetails US Patent