BDBM51821 4-(4-penten-2-ynyl)-4-(3-phenyl-2-propynyl)morpholin-4-ium::4-pent-4-en-2-ynyl-4-(3-phenylprop-2-ynyl)morpholin-4-ium;bromide::MLS000705869::SMR000226218::cid_12273833
SMILES C=CC#CC[N+]1(CC#Cc2ccccc2)CCOCC1
InChI Key InChIKey=RWSDXSKNIUDLGR-UHFFFAOYSA-N
Data  3 IC50  2 EC50
  Tab Delimited (TSV)   2D SDfile   Computed 3D by Vconf -m prep SDfile
Find this compound or compounds like it in BindingDB:
Activity Spreadsheet -- Enzyme Inhibition Constant Data from BindingDB
Found 5 hits for monomerid = 51821
LigandPNGBDBM51821(4-(4-penten-2-ynyl)-4-(3-phenyl-2-propynyl)morphol...)
Affinity DataEC50:  3.00E+4nM. Assay description: University of New Mexico Assay Overview: Assay Support: 1R03MH084830-01 Project Title: TR-FRET HTS Assay for Inhibitors of MEKK2-MEK5 PB1 Domain...
In DepthDetails PCBioAssay
LigandPNGBDBM51821(4-(4-penten-2-ynyl)-4-(3-phenyl-2-propynyl)morphol...)
Affinity DataEC50:  3.00E+4nM. Assay description: University of New Mexico Assay Overview: Assay Support: 1R03MH084830-01 Project Title: TR-FRET HTS Assay for Inhibitors of MEKK2-MEK5 PB1 Domain...
In DepthDetails PCBioAssay
TargetPhospholipase A2(Homo sapiens (Human))
Burnham Center For Chemical Genomics
Curated by PubChem BioAssay
LigandPNGBDBM51821(4-(4-penten-2-ynyl)-4-(3-phenyl-2-propynyl)morphol...)
Affinity DataIC50:  1.18E+4nM. Assay description: Data Source: Sanford-Burnham Center for Chemical Genomics (SBCCG) Source Affiliation: Sanford-Burnham Medical Research Institute (SBMRI, San Diego, C...
In DepthDetails PCBioAssay
TargetCysteine protease ATG4B(Homo sapiens (Human))
Burnham Center For Chemical Genomics
Curated by PubChem BioAssay
LigandPNGBDBM51821(4-(4-penten-2-ynyl)-4-(3-phenyl-2-propynyl)morphol...)
Affinity DataIC50:  5.56E+3nM. Assay description: Data Source: Sanford-Burnham Center for Chemical Genomics (SBCCG) Source Affiliation: Sanford-Burnham Medical Research Institute (SBMRI, San Diego, C...
In DepthDetails PCBioAssay
TargetNeutrophil cytosol factor 1 [S99G](Homo sapiens (Human))
Emory University
Curated by PubChem BioAssay
LigandPNGBDBM51821(4-(4-penten-2-ynyl)-4-(3-phenyl-2-propynyl)morphol...)
Affinity DataIC50:  6.58E+3nM. Assay description: NIH Molecular Libraries Screening Centers Network [MLSCN] Emory Chemical Biology Discovery Center in MLSCN Assay provider: Susan Smith, Emory Univers...
In DepthDetails PCBioAssay