BDBM52497 4-keto-N-(2-methyl-1,3-benzothiazol-6-yl)-3-propyl-phthalazine-1-carboxamide::MLS000335041::N-(2-methyl-1,3-benzothiazol-6-yl)-4-oxidanylidene-3-propyl-phthalazine-1-carboxamide::N-(2-methyl-1,3-benzothiazol-6-yl)-4-oxo-3-propyl-1-phthalazinecarboxamide::N-(2-methyl-1,3-benzothiazol-6-yl)-4-oxo-3-propylphthalazine-1-carboxamide::SMR000249799::cid_2097240
SMILES CCCn1nc(C(=O)Nc2ccc3nc(C)sc3c2)c2ccccc2c1=O
InChI Key InChIKey=RTCVJYQAXQBCEU-UHFFFAOYSA-N
Data  2 IC50  3 EC50
  Tab Delimited (TSV)   2D SDfile   Computed 3D by Vconf -m prep SDfile
Find this compound or compounds like it in BindingDB:
Activity Spreadsheet -- Enzyme Inhibition Constant Data from BindingDB
Found 5 hits for monomerid = 52497
TargetPOsterior Segregation(Caenorhabditis elegans)
Broad Institute
Curated by PubChem BioAssay
LigandPNGBDBM52497(4-keto-N-(2-methyl-1,3-benzothiazol-6-yl)-3-propyl...)
Affinity DataEC50:  3.00E+5nM. Assay description: Broad Institute: MLPCN maternal gene expression Project ID: 2024 Keywords: Zinc finger, C. elegans, maternal gene expression, RNA-protein interac...
In DepthDetails PCBioAssay
TargetZinc finger protein mex-5(Caenorhabditis elegans)
Broad Institute
Curated by PubChem BioAssay
LigandPNGBDBM52497(4-keto-N-(2-methyl-1,3-benzothiazol-6-yl)-3-propyl...)
Affinity DataEC50:  3.00E+5nM. Assay description: Broad Institute: MLPCN maternal gene expression Project ID: 2024 Keywords: Zinc finger, C. elegans, maternal gene expression, RNA-protein interac...
In DepthDetails PCBioAssay
TargetNuclear hormone receptor family member daf-12(Caenorhabditis elegans)
The Scripps Research Institute Molecular Screening Center
Curated by PubChem BioAssay
LigandPNGBDBM52497(4-keto-N-(2-methyl-1,3-benzothiazol-6-yl)-3-propyl...)
Affinity DataIC50:  6.75E+4nM. Assay description: Source (MLPCN Center Name): The Scripps Research Institute Molecular Screening Center Affiliation: UT Southwestern Assay Provider: David Mangelsdorf,...
In DepthDetails PCBioAssay
TargetOxysterols receptor LXR-beta(Homo sapiens (Human))
The Scripps Research Institute Molecular Screening Center
Curated by PubChem BioAssay
LigandPNGBDBM52497(4-keto-N-(2-methyl-1,3-benzothiazol-6-yl)-3-propyl...)
Affinity DataIC50:  6.75E+4nM. Assay description: Source (MLPCN Center Name): The Scripps Research Institute Molecular Screening Center Affiliation: UT Southwestern Assay Provider: David Mangelsdorf,...
In DepthDetails PCBioAssay
TargetCorticotropin-releasing factor-binding protein(Homo sapiens (Human))
Burnham Center For Chemical Genomics
Curated by PubChem BioAssay
LigandPNGBDBM52497(4-keto-N-(2-methyl-1,3-benzothiazol-6-yl)-3-propyl...)
Affinity DataEC50: >5.30E+4nM. Assay description: Data Source: Sanford-Burnham Center for Chemical Genomics (SBCCG) Source Affiliation: Sanford-Burnham Medical Research Institute (SBMRI, San Diego, C...
In DepthDetails PCBioAssay