BDBM535826 WO2022021841, 62
SMILES CC(C)(OCc1ccc(F)cc1F)C(=O)N1C[C@@H]2CCC[C@H]2C1C(=O)N[C@@H](C[C@@H]1CCNC1=O)C=O
InChI Key InChIKey=WIHKKTKDZKWGGJ-LDVHFYAMSA-N
Data  1 KI
  Tab Delimited (TSV)   2D SDfile   Computed 3D by Vconf -m prep SDfile
Find this compound or compounds like it in BindingDB:
Activity Spreadsheet -- Enzyme Inhibition Constant Data from BindingDB
Found 1 hit for monomerid = 535826
TargetReplicase polyprotein 1ab(2019-nCoV)
Sichuan University
WIPO
LigandPNGBDBM535826(WO2022021841, 62)
Affinity DataKi:  40nM. Assay description: SARS-CoV-2 Mpro (final concentration 750 nM) plus every compound in 25 uL of buffer (20 mM Tris-HCl, pH 7.5, 150mM NaCl,1mM EDTA,2mM DT...
Ligand InfoPC cidPC sid
In DepthDetails PubMed