BDBM535845 WO2022021841, 79
SMILES CC1CNC(=O)[C@@H]1C[C@H](NC(=O)C1[C@H]2[C@H](CN1C(=O)COc1ccc(OC(F)(F)F)cc1)C2(C)C)C(=O)CF
InChI Key InChIKey=RFCYRLWXWHSMIY-FLFXNSHCSA-N
Data  1 KI
  Tab Delimited (TSV)   2D SDfile   Computed 3D by Vconf -m prep SDfile
Find this compound or compounds like it in BindingDB:
Activity Spreadsheet -- Enzyme Inhibition Constant Data from BindingDB
Found 1 hit for monomerid = 535845
TargetReplicase polyprotein 1ab(2019-nCoV)
Sichuan University
WIPO
LigandPNGBDBM535845(WO2022021841, 79)
Affinity DataKi:  65nM. Assay description: SARS-CoV-2 Mpro (final concentration 750 nM) plus every compound in 25 uL of buffer (20 mM Tris-HCl, pH 7.5, 150mM NaCl,1mM EDTA,2mM DT...
Ligand InfoPC cidPC sid
In DepthDetails PubMed