BDBM77505 1-[[4-(diethylamino)benzylidene]amino]-3-(2-furfuryl)thiourea::1-[[4-(diethylamino)phenyl]methylideneamino]-3-(2-furanylmethyl)thiourea::1-[[4-(diethylamino)phenyl]methylideneamino]-3-(furan-2-ylmethyl)thiourea::4-(diethylamino)benzaldehyde N-(2-furylmethyl)thiosemicarbazone::MLS000701374::SMR000225232::cid_1226537
SMILES CCN(CC)c1ccc(C=NNC(=S)NCc2ccco2)cc1
InChI Key InChIKey=VJUNLCDAPXNXGM-UHFFFAOYSA-N
Data  2 EC50
  Tab Delimited (TSV)   2D SDfile   Computed 3D by Vconf -m prep SDfile
Find this compound or compounds like it in BindingDB:
Activity Spreadsheet -- Enzyme Inhibition Constant Data from BindingDB
Found 2 hits for monomerid = 77505
TargetCaspase-3(Homo sapiens (Human))
The Scripps Research Institute Molecular Screening Center
Curated by PubChem BioAssay
LigandPNGBDBM77505(1-[[4-(diethylamino)benzylidene]amino]-3-(2-furfur...)
Affinity DataEC50: >8.53E+4nM. Assay description: Source (MLPCN Center Name): The Scripps Research Institute Molecular Screening Center (SRIMSC) Affiliation: The Scripps Research Institute, TSR...
In DepthDetails PCBioAssay
TargetCaspase-7(Homo sapiens (Human))
The Scripps Research Institute Molecular Screening Center
Curated by PubChem BioAssay
LigandPNGBDBM77505(1-[[4-(diethylamino)benzylidene]amino]-3-(2-furfur...)
Affinity DataEC50: >8.53E+4nM. Assay description: Source (MLPCN Center Name): The Scripps Research Institute Molecular Screening Center (SRIMSC) Affiliation: The Scripps Research Institute, TSR...
In DepthDetails PCBioAssay