Target
Transient receptor potential cation channel subfamily M member 8
Ligand
BDBM507013
Substrate
IC50
331±n/a nM
Citation
 Aramini, ABianchini, GBrandolini, LBeccari, ALillini, SNano, G 2-aryl-4-hydroxy-1,3-thiazole derivatives useful as TRPM8-inhibitors in treatment of neuralgia, pain, COPD and asthma US Patent  US11046662 Publication Date 6/29/2021 
Target
Name:
Transient receptor potential cation channel subfamily M member 8
Synonyms:
LTRPC6 TRPM8_HUMAN Transient receptor potential M8 protein (TRPM8) Transient receptor potential cation channel subfamily M member 8 (TRPM8)
Type:
Enzyme
Mol. Mass.:
127693.26
Organism:
Homo sapiens (Human)
Description:
Q7Z2W7
Residue:
1104
  
Inhibitor
Name:
BDBM507013
Synonyms:
1-(2-(3-fluorophenyl)-4- hydroxythiazol-5-yl)isobutan-1-one | US11046662, Compound 38
Type:
Small organic molecule
Emp. Form.:
C14H14FNO2S
Mol. Mass.:
279.33
SMILES:
CC(C)CC(=O)c1sc(nc1O)-c1cccc(F)c1
: