Target
S-adenosylmethionine synthase isoform type-2
Ligand
BDBM507919
Substrate
Meas. Tech.
Phosphate Sensor Fluorescence Assay
IC50
<200±n/a nM
Citation
 Alam, MCleary, LFleury, MPei, ZSteel, RSutton, JKnox, JENewby, ZE 2-oxoquinazoline derivatives as methionine adenosyltransferase 2A inhibitors US Patent  US11046691 Publication Date 6/29/2021 
Target
Name:
S-adenosylmethionine synthase isoform type-2
Synonyms:
AMS2 MAT 2 MAT2A METK2_HUMAN Methionine adenosyltransferase II
Type:
Protein
Mol. Mass.:
43659.65
Organism:
Human
Description:
P31153
Residue:
395
  
Inhibitor
Name:
BDBM507919
Synonyms:
4-((2R)-2-methylpyrrolidin-1-yl)-1- phenyl-7-(trifluoromethyl)pyrido[2,3- d]-pyrimidin-2(1H)-one US11084798, Cpd No 344 | US11130759, Cpd. No. 344
Type:
Small organic molecule
Emp. Form.:
C19H17F3N4O
Mol. Mass.:
374.3597
SMILES:
C[C@@H]1CCCN1c1nc(=O)n(-c2ccccc2)c2nc(ccc12)C(F)(F)F
: