Target
S-adenosylmethionine synthase isoform type-2
Ligand
BDBM507935
Substrate
Meas. Tech.
Phosphate Sensor Fluorescence Assay
IC50
<200±n/a nM
Citation
 Alam, MCleary, LFleury, MPei, ZSteel, RSutton, JKnox, JENewby, ZE 2-oxoquinazoline derivatives as methionine adenosyltransferase 2A inhibitors US Patent  US11046691 Publication Date 6/29/2021 
Target
Name:
S-adenosylmethionine synthase isoform type-2
Synonyms:
AMS2 MAT 2 MAT2A METK2_HUMAN Methionine adenosyltransferase II
Type:
Protein
Mol. Mass.:
43659.65
Organism:
Human
Description:
P31153
Residue:
395
  
Inhibitor
Name:
BDBM507935
Synonyms:
3-[7-chloro-4-(methylamino)-2-oxo- hydroquinazolin-1-yl]benzoic acid US11084798, Cpd No 133 | US11130759, Cpd. No. 133
Type:
Small organic molecule
Emp. Form.:
C16H12ClN3O3
Mol. Mass.:
329.738
SMILES:
CNc1nc(=O)n(-c2cccc(c2)C(O)=O)c2cc(Cl)ccc12
: