Target
S-adenosylmethionine synthase isoform type-2
Ligand
BDBM508403
Substrate
Meas. Tech.
Phosphate Sensor Fluorescence Assay
IC50
<200±n/a nM
Citation
 Alam, MCleary, LFleury, MPei, ZSteel, RSutton, JKnox, JENewby, ZE 2-oxoquinazoline derivatives as methionine adenosyltransferase 2A inhibitors US Patent  US11046691 Publication Date 6/29/2021 
Target
Name:
S-adenosylmethionine synthase isoform type-2
Synonyms:
AMS2 MAT 2 MAT2A METK2_HUMAN Methionine adenosyltransferase II
Type:
Protein
Mol. Mass.:
43659.65
Organism:
Human
Description:
P31153
Residue:
395
  
Inhibitor
Name:
BDBM508403
Synonyms:
7-cyclopropyl-4-(methylamino)-1- (pyrimidin-5-yl)quinazolin-2(1H)-one US11084798, Cpd No 714 | US11130759, Cpd. No. 714
Type:
Small organic molecule
Emp. Form.:
C16H15N5O
Mol. Mass.:
293.3232
SMILES:
CNc1nc(=O)n(-c2cncnc2)c2cc(ccc12)C1CC1
: