Target
Replicase polyprotein 1ab
Ligand
BDBM509997
Substrate
Meas. Tech.
FRET-based enzymatic assay
IC50
80±4.00 nM
Citation
 Ma, CXia, ZSacco, MDHu, YTownsend, JAMeng, XChoza, JTan, HJang, JGongora, MVZhang, XZhang, FXiang, YMarty, MTChen, YWang, J Discovery of Di- and Trihaloacetamides as Covalent SARS-CoV-2 Main Protease Inhibitors with High Target Specificity. J Am Chem Soc 143:20697-20709 (2021)  
Target
Name:
Replicase polyprotein 1ab
Synonyms:
ORF1ab polyprotein pp1ab | rep
Type:
Protein
Mol. Mass.:
794070.71
Organism:
2019-nCoV
Description:
P0DTD1
Residue:
7096
  
Inhibitor
Name:
BDBM509997
Synonyms:
Jun9-89-2R
Type:
Small organic molecule
Emp. Form.:
C29H24Br3N3O2
Mol. Mass.:
686.232
SMILES:
C[C@H](NC(=O)[C@H](N(C(=O)C(Br)Br)c1ccc(cc1)-c1ccccc1)c1cccnc1)c1ccc(Br)cc1
: