Target
Metabotropic glutamate receptor 4
Ligand
BDBM525279
Substrate
Meas. Tech.
New CNS Specificity Data for AK3-238 (FA44) and AK3-99B (FA26)
Ki
>10000±n/a nM
Citation
 Koster, AKDu Bois, JMaduke, MC Compositions and methods to modulate chloride ion channel activity US Patent  US11173137 Publication Date 11/16/2021 
Target
Name:
Metabotropic glutamate receptor 4
Synonyms:
GPRC1D GRM4_HUMAN MGLUR4 Metabotropic glutamate receptor 4 (mGlu4) metabotropic glutamate 4
Type:
Protein
Mol. Mass.:
101899.95
Organism:
Homo sapiens (Human)
Description:
Q14833
Residue:
912
  
Inhibitor
Name:
BDBM525279
Synonyms:
US11173137, Compound FA26 | US11173137, Compound AK3-98B
Type:
Small organic molecule
Emp. Form.:
C14H8ClFNO2
Mol. Mass.:
276.671
SMILES:
Cc1ccc(Cl)c2[nH]c3c(ccc(F)c3c12)C([O-])=O
: