Target
Acetyl-CoA carboxylase 1
Ligand
BDBM527058
Substrate
Meas. Tech.
ACC1 Enzyme Activity Assay
IC50
1.35±n/a nM
Citation
 Wang, YZhao, LWang, YQuan, XJiang, CChen, HChen, MLi, CLiao, YLiu, QWang, CWang, HYang, SZheng, G Compound as ACC inhibitor and use thereof US Patent  US11186587 Publication Date 11/30/2021 
Target
Name:
Acetyl-CoA carboxylase 1
Synonyms:
ACAC ACACA_HUMAN ACC1 Acetyl-CoA carboxylase 1 | Acetyl-CoA carboxylase 1 (ACC1)
Type:
Protein
Mol. Mass.:
265543.22
Organism:
Homo sapiens (Human)
Description:
Q13085
Residue:
2346
  
Inhibitor
Name:
BDBM527058
Synonyms:
US11186587, Example 10
Type:
Small organic molecule
Emp. Form.:
C29H34N4O8S2
Mol. Mass.:
630.732
SMILES:
CCS(=O)(=O)N1CC(C1)n1c(=O)n(CC(OC2CCOCC2)c2ccccc2OC)c2sc(c(C)c2c1=O)-c1ncco1
: