Target
Histone acetyltransferase KAT6B
Ligand
BDBM534184
Substrate
Meas. Tech.
Kat6b Activity Assay
IC50
5250±n/a nM
Citation
 L?a, BDaniel, KAntonius, TLSimon, HNaomi, BRoman, HRoland, NStefan, GJ?rg, WAmaury, FEMatyas, GVera, PRobin, MAndreas, SJames, FS SUBSTITUTED ACYL SULFONAMIDES FOR TREATING CANCER WIPO 0:0 (2022) Target
Name:
Histone acetyltransferase KAT6B
Synonyms:
2.3.1.48 Histone acetyltransferase MOZ2 KAT6B_HUMAN MORF MOZ2 MYST4 | Monocytic leukemia zinc finger protein-related factor
Type:
PROTEIN
Mol. Mass.:
231353.44
Organism:
Homo sapiens
Description:
ChEMBL_116754
Residue:
2073
  
Inhibitor
Name:
BDBM534184
Synonyms:
N-(2,4-Dichlorobenzenesulfonyl)-6-(propan-2-yl)-1-benzofuran-2-carboxamide | WO2022081842, Example 57
Type:
Small organic molecule
Emp. Form.:
C18H15Cl2NO4S
Mol. Mass.:
412.287
SMILES:
CC(C)c1ccc2cc(oc2c1)C(=O)NS(=O)(=O)c1ccc(Cl)cc1Cl
: