Target
Replicase polyprotein 1ab
Ligand
BDBM535173
Substrate
Meas. Tech.
SARS-CoV-2 Coronavirus 3C Protease FRET Assay
Ki
110±n/a nM
Citation
 Shengyong, YLinli, L NOVEL CORONAVIRUS MAIN PROTEASE INHIBITOR, AND PREPARATION METHOD THEREFOR AND USE THEREOF WIPO 0:0 (2022) Target
Name:
Replicase polyprotein 1ab
Synonyms:
ORF1ab polyprotein pp1ab | rep
Type:
Protein
Mol. Mass.:
794070.71
Organism:
2019-nCoV
Description:
P0DTD1
Residue:
7096
  
Inhibitor
Name:
BDBM535173
Synonyms:
WO2022021841, 2
Type:
Small organic molecule
Emp. Form.:
C23H27FN2O5
Mol. Mass.:
430.4693
SMILES:
COC(=O)C[C@H](NC(=O)[C@@H]1[C@@H]2[C@H](CN1C(=O)\C=C\c1ccccc1)C2(C)C)C(=O)CF
: