Target
Replicase polyprotein 1ab
Ligand
BDBM535846
Substrate
Meas. Tech.
SARS-CoV-2 Coronavirus 3C Protease FRET Assay
Ki
23±n/a nM
Citation
 Shengyong, YLinli, L NOVEL CORONAVIRUS MAIN PROTEASE INHIBITOR, AND PREPARATION METHOD THEREFOR AND USE THEREOF WIPO 0:0 (2022) Target
Name:
Replicase polyprotein 1ab
Synonyms:
ORF1ab polyprotein pp1ab | rep
Type:
Protein
Mol. Mass.:
794070.71
Organism:
2019-nCoV
Description:
P0DTD1
Residue:
7096
  
Inhibitor
Name:
BDBM535846
Synonyms:
WO2022021841, 80
Type:
Small organic molecule
Emp. Form.:
C26H31F4N3O6
Mol. Mass.:
557.5345
SMILES:
CC1CNC(=O)[C@@H]1C[C@H](NC(=O)C1[C@@H]2CCC[C@H]2CN1C(=O)COc1ccc(OC(F)(F)F)cc1)C(=O)CF
: