Target
Eukaryotic translation initiation factor 4E-binding protein 1
Ligand
BDBM546104
Substrate
Meas. Tech.
Fluorescence Polarization Assay
IC50
2.12±n/a nM
Citation
 Sperry, SXiang, AXErnst, JTReich, SHSprengeler, PAShaghafi, MMichels, TNilewski, CTran, CVPackard, GKGrubbs, AUrkalan, KMukaiyama, T EIF4E-inhibiting compounds and methods US Patent  US11286268 Publication Date 3/29/2022 
Target
Name:
Eukaryotic translation initiation factor 4E-binding protein 1
Synonyms:
4EBP1_HUMAN GFP-4EBP Green fluorescent protein-Eukaryotic initiation factor 4E (eIF4E) binding protein
Type:
Fusion protein
Mol. Mass.:
12578.35
Organism:
Homo sapiens (Human)
Description:
Residue:
118
  
Inhibitor
Name:
BDBM546104
Synonyms:
US11286268, Compound 1603
Type:
Small organic molecule
Emp. Form.:
C36H30ClF5N8O4S2
Mol. Mass.:
833.25
SMILES:
CN(C1CCN(CC(C)(F)F)CC1)c1ncc2nc(C)n(CC#Cc3ccc(Cl)cc3-c3ccnc4c(csc34)C(=O)NS(=O)(=O)C(F)(F)F)c(=O)c2c1C#N
: