Target
GTPase KRas [1-169,G12C,C118A]
Ligand
BDBM548320
Substrate
IC50
8790±n/a nM
Citation
 Alan, LBAbhisek, BMargaret, CDongcheng, DR., KMPatricia, LVan, MVFrancesco, MM., MJJ., PAA., TNKai, Z HETEROCYCLIC SPIRO COMPOUNDS AND METHODS OF USE WIPO 0:0 (2022) Target
Name:
GTPase KRas [1-169,G12C,C118A]
Synonyms:
GTPase KRas KRAS2 RASK_HUMAN
Type:
PROTEIN
Mol. Mass.:
19407.24
Organism:
Homo sapiens (Human)
Description:
P01116[1-169,G12C,C118A]
Residue:
169
  
Inhibitor
Name:
BDBM548320
Synonyms:
WO2022093856, Example 1-17
Type:
Small organic molecule
Emp. Form.:
C23H34N8O2
Mol. Mass.:
454.5685
SMILES:
CNC(=O)C[C@H](CC(C)C)Nc1nc(nc2n(C)cnc12)N1CCC2(CN(C2)C(=O)C=C)C1
: