Target
Acetylcholinesterase
Ligand
BDBM9430
Substrate
BDBM8959
Meas. Tech.
Enzyme Inhibition Assay
pH
7.4±n/a
Temperature
310.15±n/a K
IC50
52±4 nM
Citation
 Carlier, PRChow, ESHan, YLiu, JEl Yazal, JPang, YP Heterodimeric tacrine-based acetylcholinesterase inhibitors: investigating ligand-peripheral site interactions. J Med Chem 42:4225-31 (1999)  
Target
Name:
Acetylcholinesterase
Synonyms:
ACES_RAT Acetylcholinesterase and butyrylcholinesterase (AChE and BChE) Acetylcholinesterase, AChE | Ache
Type:
Enzyme
Mol. Mass.:
68193.62
Organism:
Rattus norvegicus (rat)
Description:
P37136
Residue:
614
  
Inhibitor
Name:
BDBM9430
Synonyms:
CHEMBL1083791 N,N-Dimethyl-N-9-(1,2,3,4-tetrahydroacridinyl)-1,7-diaminoheptane Hydrochloride Salt | dimethyl[7-(1,2,3,4-tetrahydroacridin-9-ylamino)heptyl]amine trihydrochloride
Type:
Small organic molecule
Emp. Form.:
C22H33N3
Mol. Mass.:
339.5175
SMILES:
CN(C)CCCCCCCNc1c2CCCCc2nc2ccccc12
:
Substrate
Name:
BDBM8959
Synonyms:
(2-Mercaptoethyl)trimethylammonium iodide acetate Acetylthiocholine acetylthiocholine chloride | acetylthiocholine iodide
Type:
Small organic molecule
Emp. Form.:
C7H16NOS
Mol. Mass.:
162.272
SMILES:
CC(=O)SCC[N+](C)(C)C
: