Target
Vasopressin V1a receptor
Ligand
BDBM316342
Substrate
Meas. Tech.
Binding Assay
Ki
5.5±n/a nM
Citation
 Braje, WFroggett, JGeneste, HHornberger, WJantos, KKling, Avan Gaalen, M Fused heterocyclic or carbocyclic compounds carrying a substituted cycloaliphatic radical and use thereof for treating vasopressin-related diseases US Patent  US9617226 Publication Date 4/11/2017 
Target
Name:
Vasopressin V1a receptor
Synonyms:
AVPR V1a AVPR1A V1AR_HUMAN VASOPRESSIN V1A Vasopressin V1 receptor Vasopressin receptor
Type:
Receptor
Mol. Mass.:
46820.18
Organism:
Homo sapiens (Human)
Description:
P37288
Residue:
418
  
Inhibitor
Name:
BDBM316342
Synonyms:
cis-2-[2-(3-Chlorophenyl)-6-[3-[(3-hydroxy-8-azabicyclo[3.2.1]octan-8-yl)methyl]cyclobutyl]-4-oxo-quinazolin-3-yl]-N-isopropyl-acetamide | US9617226, Example 23
Type:
Small organic molecule
Emp. Form.:
C31H37ClN4O3
Mol. Mass.:
549.103
SMILES:
CC(C)NC(=O)Cn1c(nc2ccc(cc2c1=O)[C@@H]1C[C@H](CN2C3CCC2CC(O)C3)C1)-c1cccc(Cl)c1
: