Target
Amine oxidase [flavin-containing] B
Ligand
BDBM11021
Substrate
BDBM10999
Meas. Tech.
MAO Inhibition Assay
pH
7.5±n/a
Temperature
298.15±n/a K
Ki
2300±n/a nM
Citation
 Hubalek, FBinda, CKhalil, ALi, MMattevi, ACastagnoli, NEdmondson, DE Demonstration of isoleucine 199 as a structural determinant for the selective inhibition of human monoamine oxidase B by specific reversible inhibitors. J Biol Chem 280:15761-6 (2005)  
Target
Name:
Amine oxidase [flavin-containing] B
Synonyms:
AOFB_HUMAN MAOB Monoamine oxidase type B (MAO B) Monoamine oxidase type B (MAOB)
Type:
Protein
Mol. Mass.:
58768.76
Organism:
Homo sapiens (Human)
Description:
P27338
Residue:
520
  
Inhibitor
Name:
BDBM11021
Synonyms:
(2E,6E)-3,7,11-trimethyldodeca-2,6,10-trien-1-ol | trans,trans-Farnesol
Type:
Small organic molecule
Emp. Form.:
C15H26O
Mol. Mass.:
222.3663
SMILES:
[#6]\[#6](-[#6])=[#6]\[#6]-[#6]\[#6](-[#6])=[#6]\[#6]-[#6]\[#6](-[#6])=[#6]\[#6]-[#8]
:
Substrate
Name:
BDBM10999
Synonyms:
Benzenemethanamine CHEMBL522 phenylmethanamine
Type:
Small organic molecule
Emp. Form.:
C7H9N
Mol. Mass.:
107.1531
SMILES:
NCc1ccccc1
: