Target
Nuclear receptor ROR-gamma
Ligand
BDBM317848
Substrate
Meas. Tech.
Binding Assay
Ki
<100±n/a nM
Citation
 Claremon, DADillard, LWDong, CFan, YJia, LLiu, ZLotesta, SDMarcus, ASingh, SBTice, CMYuan, JZhao, WZheng, YZhuang, L Dihydropyrrolopyridine inhibitors of ROR-gamma US Patent  US9624217 Publication Date 4/18/2017 
Target
Name:
Nuclear receptor ROR-gamma
Synonyms:
NR1F3 Nuclear receptor ROR-gamma (RORC) RAR-related orphan receptor C (RORc) RORG RZRG Retinoid-related orphan receptor-gamma (RORc)
Type:
Enzyme Catalytic Domain
Mol. Mass.:
58218.40
Organism:
Homo sapiens (Human)
Description:
P51449
Residue:
518
  
Inhibitor
Name:
BDBM317848
Synonyms:
(S)—N-(4-(ethylsulfonyl)benzyl)-7-isopropyl-6-(4-(trifluoromethyl)benzyl)-6,7-dihydro-5H-pyrrolo[3,4-b]pyridine-3-carboxamide US10807980, Compound 1 US9624217, Compound 1
Type:
Small organic molecule
Emp. Form.:
C28H30F3N3O3S
Mol. Mass.:
545.616
SMILES:
CCS(=O)(=O)c1ccc(CNC(=O)c2cnc3[C@H](C(C)C)N(Cc4ccc(cc4)C(F)(F)F)Cc3c2)cc1
: