Target
Nuclear receptor ROR-gamma
Ligand
BDBM317862
Substrate
Meas. Tech.
Binding Assay
Ki
<100±n/a nM
Citation
 Claremon, DADillard, LWDong, CFan, YJia, LLiu, ZLotesta, SDMarcus, ASingh, SBTice, CMYuan, JZhao, WZheng, YZhuang, L Dihydropyrrolopyridine inhibitors of ROR-gamma US Patent  US9624217 Publication Date 4/18/2017 
Target
Name:
Nuclear receptor ROR-gamma
Synonyms:
NR1F3 Nuclear receptor ROR-gamma (RORC) RAR-related orphan receptor C (RORc) RORG RZRG Retinoid-related orphan receptor-gamma (RORc)
Type:
Enzyme Catalytic Domain
Mol. Mass.:
58218.40
Organism:
Homo sapiens (Human)
Description:
P51449
Residue:
518
  
Inhibitor
Name:
BDBM317862
Synonyms:
US10807980, Compound 15 tert-butyl (S)-3-((4-(ethylsulfonyl)benzyl)carbamoyl)-7-isopropyl-5,7-dihydro-6H-pyrrolo[3,4-b]pyridine-6-carboxylate
Type:
Small organic molecule
Emp. Form.:
C25H33N3O5S
Mol. Mass.:
487.612
SMILES:
CCS(=O)(=O)c1ccc(CNC(=O)c2cnc3[C@H](C(C)C)N(Cc3c2)C(=O)OC(C)(C)C)cc1
: