Target
Dipeptidyl peptidase 4
Ligand
BDBM11122
Substrate
BDBM11114
Meas. Tech.
DPPIV Inhibition Assay
pH
7.4±n/a
Temperature
298.15±n/a K
Ki
5.3±n/a nM
Km
73000±n/a nM
Citation
 Qiao, LBaumann, CACrysler, CSNinan, NSAbad, MCSpurlino, JCDesjarlais, RLKervinen, JNeeper, MPBayoumy, SSWilliams, RDeckman, ICDasgupta, MReed, RLHuebert, NDTomczuk, BEMoriarty, KJ Discovery, SAR, and X-ray structure of novel biaryl-based dipeptidyl peptidase IV inhibitors. Bioorg Med Chem Lett 16:123-8 (2006)  
Target
Name:
Dipeptidyl peptidase 4
Synonyms:
ADABP Adenosine deaminase complexing protein 2 CD_antigen=CD26 DPP4 DPPIV Dipeptidyl peptidase 4 (DPP IV) Dipeptidyl peptidase 4 (DPP4) Dipeptidyl peptidase 4 membrane form Dipeptidyl peptidase IV Dipeptidyl peptidase IV (DDP-IV) Dipeptidyl peptidase IV membrane form Dipeptidyl peptidase-IV (DPP-4) T-cell activation antigen CD26 | TP103
Type:
Enzyme
Mol. Mass.:
88271.01
Organism:
Homo sapiens (Human)
Description:
P27487
Residue:
766
  
Inhibitor
Name:
BDBM11122
Synonyms:
(2S)-1-[(2S)-2-amino-3-[4-(2-fluorophenyl)phenyl]propanoyl]pyrrolidine-2-carbonitrile | 4-substituted phenylalanine cyano-(S)-pyrrolidine deriv. 9
Type:
Small organic molecule
Emp. Form.:
C20H20FN3O
Mol. Mass.:
337.3907
SMILES:
N[C@@H](Cc1ccc(cc1)-c1ccccc1F)C(=O)N1CCC[C@H]1C#N
:
Substrate
Name:
BDBM11114
Synonyms:
(2S)-1-[(2S)-2-aminopropanoyl]-N-(4-nitrophenyl)pyrrolidine-2-carboxamide hydrochloride H-Ala-Pro-pNA
Type:
Small organic molecule
Emp. Form.:
C14H18N4O4
Mol. Mass.:
306.3171
SMILES:
C[C@H](N)C(=O)N1CCC[C@H]1C(=O)Nc1ccc(cc1)[N+]([O-])=O
: