Target
Ketohexokinase
Ligand
BDBM319605
Substrate
Meas. Tech.
KHK Assay A
IC50
4.40±n/a nM
Citation
 Dowling, MFernando, DFutatsugi, KHuard, KMagee, TVRaymer, BShavnya, ASmith, AThuma, BTsai, ATu, M Substituted 3-azabicyclo[3.1.0]hexanes as ketohexokinase inhibitors US Patent  US10174007 Publication Date 1/8/2019 
Target
Name:
Ketohexokinase
Synonyms:
Hepatic fructokinase KHK_HUMAN Ketohexokinase (KHK) | Ketohexokinase (KHK) Isoform C
Type:
Enzyme Catalytic Domain
Mol. Mass.:
32521.64
Organism:
Homo sapiens (Human)
Description:
Residue:
298
  
Inhibitor
Name:
BDBM319605
Synonyms:
US10174007, Example 50 | [(1R,5S,6R)-3-{5-cyano-4-(1,1-difluoroethyl)-3-fluoro-6-[(2S,3R)-3-hydroxy-2-methylazetidin-1-yl]pyridin-2-yl}-3-azabicyclo[3.1.0]hex-6-yl]acetic acid
Type:
Small organic molecule
Emp. Form.:
C19H21F3N4O3
Mol. Mass.:
410.3902
SMILES:
C[C@H]1[C@H](O)CN1c1nc(N2C[C@H]3[C@H](CC(O)=O)[C@H]3C2)c(F)c(c1C#N)C(C)(F)F
: