Target
5-hydroxytryptamine receptor 1A
Ligand
BDBM319714
Substrate
Meas. Tech.
5-HT1A Receptor Agonism Activity Test
EC50
1.29±n/a nM
Citation
 Jiang, HWang, ZLi, JZhang, RHe, YLiu, YBi, MLiu, ZTian, GChen, WYang, FWu, CWang, YJiang, XYin, JWang, GShen, J Heterocyclic compounds, process for preparation of the same and use thereof US Patent  US10174011 Publication Date 1/8/2019 
Target
Name:
5-hydroxytryptamine receptor 1A
Synonyms:
5-HT-1A 5-hydroxytryptamine receptor 1A (5-HT-1A) ADRB2RL1 Dopamine D2 receptor and serotonin 1a receptor HTR1A | Serotonin receptor 1A
Type:
Mol. Mass.:
46122.49
Organism:
Homo sapiens (Human)
Description:
Residue:
422
  
Inhibitor
Name:
BDBM319714
Synonyms:
6-(2-(4-(2-methoxybenzo[b]thiophen-4-yl)piperazin-1-yl)ethyl)-3,4-dihydroquinolin-2(1H)-one | US10174011, Example 89
Type:
Small organic molecule
Emp. Form.:
C24H27N3O2S
Mol. Mass.:
421.555
SMILES:
COc1cc2c(cccc2s1)N1CCN(CCc2ccc3NC(=O)CCc3c2)CC1
: