Target
5-hydroxytryptamine receptor 1A
Ligand
BDBM319733
Substrate
Meas. Tech.
5-HT1A Receptor Agonism Activity Test
EC50
0.379±n/a nM
Citation
 Jiang, HWang, ZLi, JZhang, RHe, YLiu, YBi, MLiu, ZTian, GChen, WYang, FWu, CWang, YJiang, XYin, JWang, GShen, J Heterocyclic compounds, process for preparation of the same and use thereof US Patent  US10174011 Publication Date 1/8/2019 
Target
Name:
5-hydroxytryptamine receptor 1A
Synonyms:
5-HT-1A 5-hydroxytryptamine receptor 1A (5-HT-1A) ADRB2RL1 Dopamine D2 receptor and serotonin 1a receptor HTR1A | Serotonin receptor 1A
Type:
Mol. Mass.:
46122.49
Organism:
Homo sapiens (Human)
Description:
Residue:
422
  
Inhibitor
Name:
BDBM319733
Synonyms:
5-(2-(4-(benzo[b]thiophen-4-yl)piperazin-1-yl)ethyl)benzo[d]thiazol-2-amine | US10174011, Example 116
Type:
Small organic molecule
Emp. Form.:
C21H22N4S2
Mol. Mass.:
394.556
SMILES:
Nc1nc2cc(CCN3CCN(CC3)c3cccc4sccc34)ccc2s1
: