Target
Mitogen-activated protein kinase 1 [8-360]
Ligand
BDBM193384
Substrate
Meas. Tech.
ERK-2 Enzymatic Assay
pH
7.3±n/a
IC50
2.60±n/a nM
Comments
extracted
Citation
 Blake, JFCook, AGaudino, JGunawardana, IWHicken, EJHunt, KWLyon, MMetcalf, ATMohr, PJMoreno, DANewhouse, BRen, LSchwarz, JChen, HGazzard, LSchmidt, JDo, S Serine/threonine kinase inhibitors US Patent  US9670208 Publication Date 6/6/2017 
Target
Name:
Mitogen-activated protein kinase 1 [8-360]
Synonyms:
ERK2 MAPK1 Mitogen Activated Kinase 1 Mitogen-activated protein kinase 1 (aa 8-360) PRKM2
Type:
Mol. Mass.:
40835.09
Organism:
Homo sapiens (Human)
Description:
P28482 aa 8-360
Residue:
353
  
Inhibitor
Name:
BDBM193384
Synonyms:
US9670208, Example 51
Type:
Small organic molecule
Emp. Form.:
C21H16F2N8
Mol. Mass.:
418.4021
SMILES:
Cn1nccc1Nc1nccc(n1)-c1ccn2c(Cc3cccc(F)c3F)nnc2c1
: