Target
Lethal factor
Ligand
BDBM11976
Substrate
fluorogenic LF protease substrate III
Meas. Tech.
HPLC Assay
pH
7.2±n/a
Temperature
300.15±n/a K
Ki
800±n/a nM
IC50
1100±n/a nM
Citation
 Schepetkin, IAKhlebnikov, AIKirpotina, LNQuinn, MT Novel small-molecule inhibitors of anthrax lethal factor identified by high-throughput screening. J Med Chem 49:5232-44 (2006)  
Target
Name:
Lethal factor
Synonyms:
Anthrax Lethal Factor (LF) Antrax lethal toxin lef | lethal factor
Type:
PROTEIN
Mol. Mass.:
93758.56
Organism:
Bacillus anthracis
Description:
ChEMBL_1460338
Residue:
809
  
Inhibitor
Name:
BDBM11976
Synonyms:
5-chloro-2-(5-{[(4E)-3,8-dioxo-5,16-dithia-2,7-diazatetracyclo[7.7.0.0^{2,6}.0^{10,15}]hexadeca-1(9),6,10(15)-trien-4-ylidene]methyl}furan-2-yl)benzoic acid | chemical diversity library compound 1
Type:
Small organic molecule
Emp. Form.:
C24H15ClN2O5S2
Mol. Mass.:
510.969
SMILES:
OC(=O)c1cc(Cl)ccc1-c1ccc(\C=c2\sc3nc(=O)c4c5CCCCc5sc4n3c2=O)o1
:
Substrate
Name:
fluorogenic LF protease substrate III
Synonyms:
Type:
Peptide
Mol. Mass.:
358.43
Organism:
Description:
Residue:
3
NA