Target
Carbonic anhydrase 2 [F130V]
Ligand
BDBM12021
Substrate
BDBM11402
Meas. Tech.
In vitro binding of inhibitor to hCA-II
pH
7.4±n/a
Temperature
310.15±n/a K
Kd
3.9±n/a nM
Citation
 Kim, CYChandra, PPJain, AChristianson, DW Fluoroaromatic-fluoroaromatic interactions between inhibitors bound in the crystal lattice of human carbonic anhydrase II. J Am Chem Soc 123:9620-7 (2001)  
Target
Name:
Carbonic anhydrase 2 [F130V]
Synonyms:
CA-II CAH2_HUMAN Carbonic Anhydrase II Mutant (F130V) | Carbonic anhydrase C
Type:
Enzyme
Mol. Mass.:
29202.67
Organism:
Homo sapiens (Human)
Description:
P00918[F130V]
Residue:
260
  
Inhibitor
Name:
BDBM12021
Synonyms:
2,4,6-trifluoro-SBB 4-sulfamoyl-N-[(2,4,6-trifluorophenyl)methyl]benzamide
Type:
Small organic molecule
Emp. Form.:
C14H11F3N2O3S
Mol. Mass.:
344.309
SMILES:
NS(=O)(=O)c1ccc(cc1)C(=O)NCc1c(F)cc(F)cc1F
:
Substrate
Name:
BDBM11402
Synonyms:
5-(dimethylamino)naphthalene-1-sulfonamide | dansylamide
Type:
Small organic molecule
Emp. Form.:
C12H14N2O2S
Mol. Mass.:
250.317
SMILES:
CN(C)c1cccc2c(cccc12)S(N)(=O)=O
: