Target
Prolyl endopeptidase FAP
Ligand
BDBM12170
Substrate
BDBM11526
Meas. Tech.
Enzyme Inhibition Assay
IC50
5129±n/a nM
Citation
 Tsai, TYCoumar, MSHsu, THsieh, HPChien, CHChen, CTChang, CNLo, YKWu, SHHuang, CYHuang, YWWang, MHWu, HYLee, HJChen, XChao, YSJiaang, WT Substituted pyrrolidine-2,4-dicarboxylic acid amides as potent dipeptidyl peptidase IV inhibitors. Bioorg Med Chem Lett 16:3268-72 (2006)  
Target
Name:
Prolyl endopeptidase FAP
Synonyms:
170 kDa melanoma membrane-bound gelatinase Fibroblast Activation Protein (FAP) Integral membrane serine protease Seprase
Type:
Enzyme
Mol. Mass.:
87712.48
Organism:
Homo sapiens (Human)
Description:
Q12884
Residue:
760
  
Inhibitor
Name:
BDBM12170
Synonyms:
5,6-dichloro-2-{[(3S,5S)-5-(pyrrolidin-1-ylcarbonyl)pyrrolidin-3-yl]carbonyl}-2,3-dihydro-1H-isoindole | pyrrolidine-2,4-dicarboxylic acid amide 8f
Type:
Small organic molecule
Emp. Form.:
C18H21Cl2N3O2
Mol. Mass.:
382.284
SMILES:
Clc1cc2CN(Cc2cc1Cl)C(=O)[C@@H]1CN[C@@H](C1)C(=O)N1CCCC1
:
Substrate
Name:
BDBM11526
Synonyms:
1-(2-aminoacetyl)-N-(4-nitrophenyl)pyrrolidine-2-carboxamide Gly-Pro-pNA
Type:
Small organic molecule
Emp. Form.:
C13H16N4O4
Mol. Mass.:
292.2905
SMILES:
NCC(=O)N1CCCC1C(=O)Nc1ccc(cc1)[N+]([O-])=O
: