Target
Prolyl endopeptidase FAP
Ligand
BDBM12178
Substrate
BDBM11526
Meas. Tech.
Enzyme Inhibition Assay
IC50
175±n/a nM
Citation
 Tsai, TYCoumar, MSHsu, THsieh, HPChien, CHChen, CTChang, CNLo, YKWu, SHHuang, CYHuang, YWWang, MHWu, HYLee, HJChen, XChao, YSJiaang, WT Substituted pyrrolidine-2,4-dicarboxylic acid amides as potent dipeptidyl peptidase IV inhibitors. Bioorg Med Chem Lett 16:3268-72 (2006)  
Target
Name:
Prolyl endopeptidase FAP
Synonyms:
170 kDa melanoma membrane-bound gelatinase Fibroblast Activation Protein (FAP) Integral membrane serine protease Seprase
Type:
Enzyme
Mol. Mass.:
87712.48
Organism:
Homo sapiens (Human)
Description:
Q12884
Residue:
760
  
Inhibitor
Name:
BDBM12178
Synonyms:
(2S)-1-{[(2S,4S)-4-(2,3-dihydro-1H-isoindol-2-ylcarbonyl)pyrrolidin-2-yl]carbonyl}pyrrolidine-2-carbonitrile | pyrrolidine-2,4-dicarboxylic acid amide 11a
Type:
Small organic molecule
Emp. Form.:
C19H22N4O2
Mol. Mass.:
338.4036
SMILES:
O=C([C@@H]1CN[C@@H](C1)C(=O)N1CCC[C@H]1C#N)N1Cc2ccccc2C1
:
Substrate
Name:
BDBM11526
Synonyms:
1-(2-aminoacetyl)-N-(4-nitrophenyl)pyrrolidine-2-carboxamide Gly-Pro-pNA
Type:
Small organic molecule
Emp. Form.:
C13H16N4O4
Mol. Mass.:
292.2905
SMILES:
NCC(=O)N1CCCC1C(=O)Nc1ccc(cc1)[N+]([O-])=O
: