Target
Tyrosine-protein kinase JAK2
Ligand
BDBM332969
Substrate
Ki
<10±n/a nM
Citation
 Masse, CEGreenwood, JRRomero, DLHarriman, GCWester, RTShelley, MKennedy-Smith, JJDahlgren, M TYK2 inhibitors and uses thereof US Patent  US10196390 Publication Date 2/5/2019 
Target
Name:
Tyrosine-protein kinase JAK2
Synonyms:
JAK-2 JAK2_HUMAN Janus kinase 2 (JAK2) | Janus kinase 2 (a protein tyrosine kinase)
Type:
Protein
Mol. Mass.:
130684.68
Organism:
Homo sapiens (Human)
Description:
O60674
Residue:
1132
  
Inhibitor
Name:
BDBM332969
Synonyms:
US10196390, Compound I-258
Type:
Small organic molecule
Emp. Form.:
C20H14FN5O2
Mol. Mass.:
375.3559
SMILES:
COc1ccc(Nc2cc(nc3CNC(=O)c23)-c2c(F)cccc2C#N)nc1
: