Target
Tyrosine-protein kinase JAK2
Ligand
BDBM332986
Substrate
Ki
55±n/a nM
Citation
 Masse, CEGreenwood, JRRomero, DLHarriman, GCWester, RTShelley, MKennedy-Smith, JJDahlgren, M TYK2 inhibitors and uses thereof US Patent  US10196390 Publication Date 2/5/2019 
Target
Name:
Tyrosine-protein kinase JAK2
Synonyms:
JAK-2 JAK2_HUMAN Janus kinase 2 (JAK2) | Janus kinase 2 (a protein tyrosine kinase)
Type:
Protein
Mol. Mass.:
130684.68
Organism:
Homo sapiens (Human)
Description:
O60674
Residue:
1132
  
Inhibitor
Name:
BDBM332986
Synonyms:
US10196390, Compound I-275 US11040967, Compound 12
Type:
Small organic molecule
Emp. Form.:
C26H24F2N4O3
Mol. Mass.:
478.4906
SMILES:
CC1(O)CCN(CC1)C(=O)c1ccc(Nc2cc(nc3CNC(=O)c23)-c2c(F)cccc2F)cc1
: