Target
Serine/threonine-protein kinase B-raf [V600E]
Ligand
BDBM333575
Substrate
Meas. Tech.
Competition Binding Assay
Kd
375±n/a nM
Citation
 Abraham, SBhagwat, SSCampbell, BTChao, QFaraoni, RHolladay, MWLai, AGRowbottom, MWSetti, ESprankle, KG RAF kinase modulator compounds and methods of use thereof US Patent  US9730937 Publication Date 8/15/2017 
Target
Name:
Serine/threonine-protein kinase B-raf [V600E]
Synonyms:
B-RAF V600E B-Raf Protein Kinase Mutant (V600E) BRAF BRAF mutant V600E BRAF_HUMAN Protein mono-ADP-ribosyltransferase (PARP3) RAFB1 Serine/threonine-protein kinase B-raf (V600E) V-RAF murine sarcoma viral oncogene homologue B1 mutant (BRAF V600E)
Type:
Mol. Mass.:
84474.98
Organism:
Homo sapiens (Human)
Description:
P15056 V600E
Residue:
766
  
Inhibitor
Name:
BDBM333575
Synonyms:
1-(3-(6,7- dimethoxy- quinazolin- 4- yloxy)phenyl)- 3-(3- (tetrahydro- 2H-pyran-4- yl(isoxazol- 5-yl)urea | US9730937, Example 123
Type:
Small organic molecule
Emp. Form.:
C25H25N5O6
Mol. Mass.:
491.4959
SMILES:
COc1cc2ncnc(Oc3cccc(NC(=O)Nc4cc(no4)C4CCOCC4)c3)c2cc1OC
: