Target
Coagulation factor X
Ligand
BDBM13579
Substrate
BDBM12658
Meas. Tech.
Serine Protease Inhibition Assay
Ki
39000±n/a nM
Citation
 Groebke Zbinden, KBanner, DWAckermann, JD'Arcy, AKirchhofer, DJi, YHTschopp, TBWallbaum, SWeber, L Design of selective phenylglycine amide tissue factor/factor VIIa inhibitors. Bioorg Med Chem Lett 15:817-22 (2005)  
Target
Name:
Coagulation factor X
Synonyms:
Activated coagulation factor X (FXa) Coagulation factor X precursor F10 Factor X heavy chain Factor Xa Stuart-Prower factor
Type:
Enzyme
Mol. Mass.:
54726.60
Organism:
Homo sapiens (Human)
Description:
Residue:
488
  
Inhibitor
Name:
BDBM13579
Synonyms:
4-{[(3,4-diethoxyphenyl)methyl]amino}benzene-1-carboximidamide | benzylamine 5
Type:
Small organic molecule
Emp. Form.:
C18H23N3O2
Mol. Mass.:
313.3941
SMILES:
CCOc1ccc(CNc2ccc(cc2)C(N)=N)cc1OCC
:
Substrate
Name:
BDBM12658
Synonyms:
4-[({[(1S)-4-carbamimidamido-1-[(4-nitrophenyl)carbamoyl]butyl]carbamoyl}methyl)carbamoyl]-4-[(2S,3S)-3-methyl-2-(phenylformamido)pentanamido]butanoic acid hydrochloride Chromogenic Substrate S-2222 benzoyl-Ile-Glu-Gly-Arg-p-nitroanilide
Type:
Small organic molecule
Emp. Form.:
C32H43N9O9
Mol. Mass.:
697.7387
SMILES:
[#6]-[#6]-[#6@H](-[#6])-[#6@H](-[#7]-[#6](=O)-c1ccccc1)-[#6](=O)-[#7]-[#6@@H](-[#6]-[#6]-[#6](-[#8])=O)-[#6](=O)-[#7]-[#6]-[#6](=O)-[#7]-[#6@@H](-[#6]-[#6]-[#6]\[#7]=[#6](\[#7])-[#7])-[#6](=O)-[#7]-c1ccc(cc1)-[#7+](-[#8-])=O
: