Target
Prothrombin
Ligand
BDBM14078
Substrate
BDBM14064
Meas. Tech.
Enzyme Inhibition Assay
pH
7.4±n/a
Temperature
310.15±n/a K
Ki
2.1±0.7 nM
IC50
15±n/a nM
Citation
 Costanzo, MJAlmond, HRHecker, LRSchott, MRYabut, SCZhang, HCAndrade-Gordon, PCorcoran, TWGiardino, ECKauffman, JALewis, JMde Garavilla, LHaertlein, BJMaryanoff, BE In-depth study of tripeptide-based alpha-ketoheterocycles as inhibitors of thrombin. Effective utilization of the S1' subsite and its implications to structure-based drug design. J Med Chem 48:1984-2008 (2005)  
Target
Name:
Prothrombin
Synonyms:
Activation peptide fragment 1 Coagulation factor II Prothrombin precursor Thrombin heavy chain | Thrombin light chain
Type:
Protein
Mol. Mass.:
70029.57
Organism:
Homo sapiens (Human)
Description:
P00734
Residue:
622
  
Inhibitor
Name:
BDBM14078
Synonyms:
(2S)-1-(2-amino-2,2-diphenylacetyl)-N-[1-(1,3-benzothiazol-2-yl)-5-carbamimidamido-1-oxopentan-2-yl]pyrrolidine-2-carboxamide | 2-ketobenzothiazole 18
Type:
Small organic molecule
Emp. Form.:
C32H35N7O3S
Mol. Mass.:
597.73
SMILES:
[#7]\[#6](-[#7])=[#7]\[#6]-[#6]-[#6]-[#6](-[#7]-[#6](=O)-[#6@@H]-1-[#6]-[#6]-[#6]-[#7]-1-[#6](=O)C([#7])(c1ccccc1)c1ccccc1)-[#6](=O)-c1nc2ccccc2s1
:
Substrate
Name:
BDBM14064
Synonyms:
(2S)-2-[(2S)-2-[(2R)-2-amino-3-(4-hydroxycyclohexyl)propanamido]propanamido]-5-carbamimidamido-N-(4-nitrophenyl)pentanamide; bis(acetic acid) Spectozyme TH
Type:
Small organic molecule
Emp. Form.:
C24H38N8O6
Mol. Mass.:
534.6085
SMILES:
CC(NC(=O)C(N)CC1CCC(O)CC1)C(=O)NC(CCC\[NH+]=C(\N)[NH-])C(=O)Nc1ccc(cc1)[N+]([O-])=O
: