Target
Prothrombin
Ligand
BDBM14128
Substrate
BDBM14064
Meas. Tech.
Enzyme Inhibition Assay
Ki
1.3±n/a nM
IC50
38±n/a nM
Citation
 Costanzo, MJAlmond, HRHecker, LRSchott, MRYabut, SCZhang, HCAndrade-Gordon, PCorcoran, TWGiardino, ECKauffman, JALewis, JMde Garavilla, LHaertlein, BJMaryanoff, BE In-depth study of tripeptide-based alpha-ketoheterocycles as inhibitors of thrombin. Effective utilization of the S1' subsite and its implications to structure-based drug design. J Med Chem 48:1984-2008 (2005)  
Target
Name:
Prothrombin
Synonyms:
Activation peptide fragment 1 Coagulation factor II Prothrombin precursor Thrombin heavy chain | Thrombin light chain
Type:
Protein
Mol. Mass.:
70029.57
Organism:
Homo sapiens (Human)
Description:
P00734
Residue:
622
  
Inhibitor
Name:
BDBM14128
Synonyms:
2-ketobenzothiazole 68 | methyl 2-(5-carbamimidamido-2-{[(2S)-1-[(2R)-2-(methylamino)-3-phenylpropanoyl]pyrrolidin-2-yl]formamido}pentanoyl)-1,3-benzothiazole-6-carboxylate
Type:
Small organic molecule
Emp. Form.:
C30H37N7O5S
Mol. Mass.:
607.724
SMILES:
[#6]-[#7]-[#6@H](-[#6]-c1ccccc1)-[#6](=O)-[#7]-1-[#6]-[#6]-[#6]-[#6@H]-1-[#6](=O)-[#7]-[#6](-[#6]-[#6]-[#6]\[#7]=[#6](/[#7])-[#7])-[#6](=O)-c1nc2ccc(cc2s1)-[#6](=O)-[#8]-[#6]
:
Substrate
Name:
BDBM14064
Synonyms:
(2S)-2-[(2S)-2-[(2R)-2-amino-3-(4-hydroxycyclohexyl)propanamido]propanamido]-5-carbamimidamido-N-(4-nitrophenyl)pentanamide; bis(acetic acid) Spectozyme TH
Type:
Small organic molecule
Emp. Form.:
C24H38N8O6
Mol. Mass.:
534.6085
SMILES:
CC(NC(=O)C(N)CC1CCC(O)CC1)C(=O)NC(CCC\[NH+]=C(\N)[NH-])C(=O)Nc1ccc(cc1)[N+]([O-])=O
: