Target
Cyclin-dependent kinase 4/G1/S-specific cyclin-D1 [L188C]
Ligand
BDBM14195
Substrate
Retinoblastoma (Rb)
Meas. Tech.
Aurora Kinase Inhibition Assay
IC50
340±n/a nM
Citation
 Moriarty, KJKoblish, HKGarrabrant, TMaisuria, JKhalil, EAli, FPetrounia, IPCrysler, CSMaroney, ACJohnson, DLGalemmo, RA The synthesis and SAR of 2-amino-pyrrolo[2,3-d]pyrimidines: a new class of Aurora-A kinase inhibitors. Bioorg Med Chem Lett 16:5778-83 (2006)  
Target
Name:
Cyclin-dependent kinase 4/G1/S-specific cyclin-D1 [L188C]
Synonyms:
CDK4/Cyclin D | Cyclin-Dependent Kinase 4 (CDK4)
Type:
Protein Complex
Mol. Mass.:
Description:
CDK4/D complexes were purified from insect cells co-infected with baculovirus vectors containing each of the components.
Components:
This complex has 2 components.
Component 1
Name:
Cyclin-dependent kinase 4
Synonyms:
CDK4 Cell division protein kinase 4 PSK-J3
Type:
Enzyme Subunit
Mol. Mass.:
33731.96
Organism:
Homo sapiens (Human)
Description:
P11802
Residue:
303
  
Component 2
Name:
G1/S-specific cyclin-D1 [L188C]
Synonyms:
BCL1 CCND1_HUMAN PRAD1
Type:
Enzyme Subunit
Mol. Mass.:
33634.57
Organism:
Homo sapiens (Human)
Description:
P24385[L188C]
Residue:
295
  
Inhibitor
Name:
BDBM14195
Synonyms:
7-(3-methoxyphenyl)-N-[4-(4-methylpiperazin-1-yl)phenyl]-7H-pyrrolo[2,3-d]pyrimidin-2-amine | pyrrolopyrimidine 18
Type:
Small organic molecule
Emp. Form.:
C24H26N6O
Mol. Mass.:
414.5028
SMILES:
COc1cccc(c1)-n1ccc2cnc(Nc3ccc(cc3)N3CCN(C)CC3)nc12
:
Substrate
Name:
Retinoblastoma (Rb)
Synonyms:
RB1 Rb p105-Rb pp110
Type:
Other Protein Type
Mol. Mass.:
17470.92
Organism:
Homo sapiens (Human)
Description:
Recombinant fusion protein containing the C-terminal fragment (residues 773-928)
Residue:
156