Target
cAMP and cAMP-inhibited cGMP 3',5'-cyclic phosphodiesterase 10A
Ligand
BDBM14748
Substrate
BDBM10851
Meas. Tech.
PDE Competitive Enzyme Inhibition Assay
pH
7.5±n/a
Temperature
295.15±n/a K
Ki
54±33 nM
Citation
 Chappie, TAHumphrey, JMAllen, MPEstep, KGFox, CBLebel, LALiras, SMarr, ESMenniti, FSPandit, JSchmidt, CJTu, MWilliams, RDYang, FV Discovery of a series of 6,7-dimethoxy-4-pyrrolidylquinazoline PDE10A inhibitors. J Med Chem 50:182-5 (2007)  
Target
Name:
cAMP and cAMP-inhibited cGMP 3',5'-cyclic phosphodiesterase 10A
Synonyms:
PDE10_RAT Phosphodiesterase 10 Phosphodiesterase Type 10 (PDE10A) | Rat recombinant PDE10a (rPDE10a)
Type:
Enzyme
Mol. Mass.:
90160.88
Organism:
Rattus norvegicus (rat)
Description:
PDE10A was generated from the full-length recombinant rat clone transfected into Sf9 cells.
Residue:
794
  
Inhibitor
Name:
BDBM14748
Synonyms:
(R)-4-[3-(4-Ethoxy-phenoxy)-pyrrolidin-1-yl]-6,7-dimethoxy-quinazoline 6,7-Dimethoxy-4-pyrrolidylquinazoline 11
Type:
Small organic molecule
Emp. Form.:
C22H25N3O4
Mol. Mass.:
395.4516
SMILES:
CCOc1ccc(O[C@@H]2CCN(C2)c2ncnc3cc(OC)c(OC)cc23)cc1
:
Substrate
Name:
BDBM10851
Synonyms:
(4aR,6R,7R,7aS)-6-(6-amino-9H-purin-9-yl)-2,7-dihydroxy-hexahydro-1,3,5,2-furo[3,2-d][1,3,2]dioxaphosphinin-2-one ADENOSINE-3 ,5 -CYCLIC-MONOPHOSPHATE cAMP | cid_23902375
Type:
Small organic molecule
Emp. Form.:
C10H12N5O6P
Mol. Mass.:
329.2059
SMILES:
Nc1ncnc2n(cnc12)[C@@H]1O[C@@H]2COP(O)(=O)O[C@H]2[C@H]1O
: