Target
Beta-secretase 1
Ligand
BDBM16250
Substrate
Fluorogenic Substrate
Meas. Tech.
Enzyme Inhibition Measurements
pH
4.5±n/a
Temperature
310.15±n/a K
Ki
2.5±n/a nM
Citation
 Ghosh, AKBilcer, GHarwood, CKawahama, RShin, DHussain, KAHong, LLoy, JANguyen, CKoelsch, GErmolieff, JTang, J Structure-based design: potent inhibitors of human brain memapsin 2 (beta-secretase). J Med Chem 44:2865-8 (2001)  
Target
Name:
Beta-secretase 1
Synonyms:
ASP2 Aspartyl protease 2 BACE1 Beta-secretase (BACE) Beta-secretase 1 (BACE 1) Beta-secretase 1 (BACE1) Beta-site amyloid precursor protein cleaving enzyme 1 Memapsin-2 beta-Secretase (BACE-1) | beta-Secretase (BACE1)
Type:
Protein
Mol. Mass.:
55755.10
Organism:
Homo sapiens (Human)
Description:
P56817
Residue:
501
  
Inhibitor
Name:
BDBM16250
Synonyms:
CHEMBL290001 Substrate-based BACE-1 inhibitor, 22 peptidomimetic memapsin 2 inhibitor 2 | tert-butyl N-[(1S)-1-{[(1S)-1-{[(1R,3S,4S)-1-{[(1S)-1-(benzylcarbamoyl)-2-methylpropyl]carbamoyl}-3-hydroxy-1,6-dimethylheptan-4-yl]carbamoyl}-3-(methylsulfanyl)propyl]carbamoyl}-2-methylpropyl]carbamate
Type:
Small organic molecule
Emp. Form.:
C37H63N5O7S
Mol. Mass.:
721.99
SMILES:
CSCC[C@H](NC(=O)[C@@H](NC(=O)OC(C)(C)C)C(C)C)C(=O)N[C@@H](CC(C)C)[C@@H](O)C[C@@H](C)C(=O)N[C@@H](C(C)C)C(=O)NCc1ccccc1
:
Substrate
Name:
Fluorogenic Substrate
Synonyms:
Type:
Peptide
Mol. Mass.:
4212.11
Organism:
Description:
Residue:
42