Target
Cathepsin K
Ligand
BDBM19491
Substrate
BDBM19480
Meas. Tech.
Enzyme Inhibition Assay
IC50
0.3±n/a nM
Citation
 Gauthier, JYBlack, WCCourchesne, ICromlish, WDesmarais, SHoule, RLamontagne, SLi, CSMassé, FMcKay, DJOuellet, MRobichaud, JTruchon, JFTruong, VLWang, QPercival, MD The identification of potent, selective, and bioavailable cathepsin S inhibitors. Bioorg Med Chem Lett 17:4929-33 (2007)  
Target
Name:
Cathepsin K
Synonyms:
CATK_RABIT | CTSK
Type:
Enzyme
Mol. Mass.:
36879.51
Organism:
Oryctolagus cuniculus (rabbit)
Description:
Residue:
329
  
Inhibitor
Name:
BDBM19491
Synonyms:
(2S)-N-(1-cyanocyclopropyl)-4-methyl-2-{[(1S)-2,2,2-trifluoro-1-[4-(4-methanesulfonylphenyl)phenyl]ethyl]amino}pentanamide | trifluoroethylamine inhibitor, 1
Type:
Small organic molecule
Emp. Form.:
C25H28F3N3O3S
Mol. Mass.:
507.568
SMILES:
CC(C)C[C@H](N[C@@H](c1ccc(cc1)-c1ccc(cc1)S(C)(=O)=O)C(F)(F)F)C(=O)NC1(CC1)C#N
:
Substrate
Name:
BDBM19480
Synonyms:
Cbz-Leu-Arg-AMC Z-Leu-Arg-AMC
Type:
Emp. Form.:
Mol. Mass.:
SMILES:
: