Target
Calcitonin gene-related peptide type 1 receptor
Ligand
BDBM362044
Substrate
Meas. Tech.
Receptor Functional Assay
Ki
0.015±n/a nM
Citation
 Bell, IMFraley, MEGallicchio, SNGinnetti, AMitchell, HJPaone, DVStaas, DDWang, CZartman, CB Piperidinone carboxamide azaindane CGRP receptor antagonists US Patent  US9833448 Publication Date 12/5/2017 
Target
Name:
Calcitonin gene-related peptide type 1 receptor
Synonyms:
Adrenomedullin receptor AM1; CALCRL/RAMP2 CALRL_HUMAN CGRP type 1 receptor mRNA Calcitonin gene-related peptide (CGRP) receptor Calcitonin receptor-like receptor Human CL receptor
Type:
Enzyme Catalytic Domain
Mol. Mass.:
52980.45
Organism:
Homo sapiens (Human)
Description:
Q16602
Residue:
461
  
Inhibitor
Name:
BDBM362044
Synonyms:
US10272077, Example 4 | US9833448, Example 4
Type:
Small organic molecule
Emp. Form.:
C29H23F6N5O3
Mol. Mass.:
603.515
SMILES:
C[C@@H]1[C@@H](C[C@H](NC(=O)c2cnc3C[C@]4(Cc3c2)C(=O)Nc2ncccc42)C(=O)N1CC(F)(F)F)c1c(F)ccc(F)c1F
: