Target
Mitotic checkpoint serine/threonine-protein kinase BUB1
Ligand
BDBM367349
Substrate
Meas. Tech.
Bub1 kinase assay
IC50
5.00±n/a nM
Citation
 Graham, KKlar, UBriem, HSiemeister, GMönning, UBalint, J 3-amino-1,5,6,7-tetrahydro-4H-indol-4-ones US Patent  US10227299 Publication Date 3/12/2019 
Target
Name:
Mitotic checkpoint serine/threonine-protein kinase BUB1
Synonyms:
BUB1 BUB1L hBUB1
Type:
PROTEIN
Mol. Mass.:
122372.31
Organism:
Homo sapiens (Human)
Description:
ChEMBL_1510603
Residue:
1085
  
Inhibitor
Name:
BDBM367349
Synonyms:
(6RS)-6-Ethenyl-3-(phenylamino)-2-(pyridin-4-yl)-1,5,6,7-tetrahydro-4H-indol-4-one | US10227299, Example 40
Type:
Small organic molecule
Emp. Form.:
C21H19N3O
Mol. Mass.:
329.3951
SMILES:
C=CC1Cc2[nH]c(c(Nc3ccccc3)c2C(=O)C1)-c1ccncc1
: