Target
Mitotic checkpoint serine/threonine-protein kinase BUB1
Ligand
BDBM367598
Substrate
Meas. Tech.
Bub1 kinase assay
IC50
3.00±n/a nM
Citation
 Graham, KKlar, UBriem, HSiemeister, GMönning, UBalint, J 3-amino-1,5,6,7-tetrahydro-4H-indol-4-ones US Patent  US10227299 Publication Date 3/12/2019 
Target
Name:
Mitotic checkpoint serine/threonine-protein kinase BUB1
Synonyms:
BUB1 BUB1L hBUB1
Type:
PROTEIN
Mol. Mass.:
122372.31
Organism:
Homo sapiens (Human)
Description:
ChEMBL_1510603
Residue:
1085
  
Inhibitor
Name:
BDBM367598
Synonyms:
US10227299, Example 288
Type:
Small organic molecule
Emp. Form.:
C22H21N3O
Mol. Mass.:
343.4216
SMILES:
C=CCC1Cc2[nH]c(c(Nc3ccccc3)c2C(=O)C1)-c1ccncc1
: