Target
Mu-type opioid receptor
Ligand
BDBM21115
Substrate
BDBM21015
Meas. Tech.
Radioligand Labeled Binding Assay and [35S]GTP-gamma-S Binding Assay
pH
7.4±n/a
Temperature
298.15±n/a K
Ki
14±n/a nM
EC50
125±n/a nM
Citation
 Lee, YSPetrov, RPark, CKMa, SWDavis, PLai, JPorreca, FVardanyan, RHruby, VJ Development of novel enkephalin analogues that have enhanced opioid activities at both mu and delta opioid receptors. J Med Chem 50:5528-32 (2007)  
Target
Name:
Mu-type opioid receptor
Synonyms:
MOR-1 Mu-type opioid receptor (MOR) OPRM_RAT Opioid receptor B Ror-b
Type:
G Protein-Coupled Receptor (GPCR)
Mol. Mass.:
44503.11
Organism:
Rattus norvegicus (rat)
Description:
Competition binding assays were carried out using membrane preparations from transfected HN9.10 cells that constitutively expressed the mu opioid receptor.
Residue:
398
  
Inhibitor
Name:
BDBM21115
Synonyms:
(2S)-2-{2-[(2R)-2-[(2S)-2-amino-3-(4-hydroxyphenyl)propanamido]propanamido]acetamido}-3-phenyl-N-[1-(2-phenylethyl)piperidin-4-yl]propanamide | 4-anilidopiperidine, 10
Type:
Peptide-like ligand
Emp. Form.:
C36H46N6O5
Mol. Mass.:
642.7876
SMILES:
C[C@@H](NC(=O)[C@@H](N)Cc1ccc(O)cc1)C(=O)NCC(=O)N[C@@H](Cc1ccccc1)C(=O)NC1CCN(CCc2ccccc2)CC1
:
Substrate
Name:
BDBM21015
Synonyms:
(2S)-2-{2-[(2R)-2-[(2S)-2-amino-3-(4-hydroxyphenyl)propanamido]propanamido]-N-methylacetamido}-N-(2-hydroxyethyl)-3-phenylpropanamide CHEMBL38874 DAMGO US11492374, ID 2 [tyrosyl-3,5-3H(N)]-D-Ala2-Mephe4-glyol5-enkephalin
Type:
Analgesics
Emp. Form.:
C26H35N5O6
Mol. Mass.:
513.586
SMILES:
C[C@@H](NC(=O)[C@@H](N)Cc1ccc(O)cc1)C(=O)NCC(=O)N(C)[C@@H](Cc1ccccc1)C(=O)NCCO
: