Target
Adenosine receptor A1
Ligand
BDBM21220
Substrate
BDBM21173
Meas. Tech.
Human A1 Adenosine Receptor Binding Assay
pH
7.4±n/a
Temperature
298.15±n/a K
Ki
14±4 nM
Citation
 Cosimelli, BGreco, GEhlardo, MNovellino, EDa Settimo, FTaliani, SLa Motta, CBellandi, MTuccinardi, TMartinelli, ACiampi, OTrincavelli, MLMartini, C Derivatives of 4-Amino-6-hydroxy-2-mercaptopyrimidine as Novel, Potent, and Selective A3 Adenosine Receptor Antagonists. J Med Chem 51:1764-70 (2008)  
Target
Name:
Adenosine receptor A1
Synonyms:
A1 adenosine receptor (hA1) AA1R_HUMAN ADORA1 Adenosine A1-receptor Adenosine receptor A1 (hA1) | Adenosine transporter (AdT)
Type:
G Protein-Coupled Receptor (GPCR)
Mol. Mass.:
36520.92
Organism:
Homo sapiens (Human)
Description:
P30542
Residue:
326
  
Inhibitor
Name:
BDBM21220
Synonyms:
(2S,3S,4R,5R)-5-(6-amino-9H-purin-9-yl)-N-ethyl-3,4-dihydroxyoxolane-2-carboxamide Adenosine, N6-Ethyl-carboxamido CHEMBL464859 NECA
Type:
Antineoplastic Agent
Emp. Form.:
C12H16N6O4
Mol. Mass.:
308.2932
SMILES:
CCNC(=O)[C@H]1O[C@H]([C@H](O)[C@@H]1O)n1cnc2c(N)ncnc12
:
Substrate
Name:
BDBM21173
Synonyms:
1,3-dipropyl-8-cyclopentylxanthine CHEMBL183 PD116948 | [3H]DPCPX
Type:
radiolabeled ligand
Emp. Form.:
C16H24N4O2
Mol. Mass.:
304.3874
SMILES:
CCCn1c2nc([nH]c2c(=O)n(CCC)c1=O)C1CCCC1
: