Target
Neprilysin
Ligand
BDBM21657
Substrate
BDBM21631
Meas. Tech.
In Vitro Inhibition of NEP
pH
7.4±n/a
Temperature
310.15±n/a K
Ki
3.0±0.4 nM
Km
37000±n/a nM
Citation
 Inguimbert, NCoric, PPoras, HMeudal, HTeffot, FFournié-Zaluski, MCRoques, BP Toward an optimal joint recognition of the S1' subsites of endothelin converting enzyme-1 (ECE-1), angiotensin converting enzyme (ACE), and neutral endopeptidase (NEP). J Med Chem 45:1477-86 (2002)  
Target
Name:
Neprilysin
Synonyms:
Atriopeptidase CD_antigen=CD10 MME NEP_RABIT Neutral endopeptidase 24.11
Type:
Enzyme
Mol. Mass.:
85570.75
Organism:
Oryctolagus cuniculus (rabbit)
Description:
NEP was purified to homogeneity from rabbit kidney.
Residue:
750
  
Inhibitor
Name:
BDBM21657
Synonyms:
(2S)-3-(1H-indol-3-yl)-2-[(2R)-3-sulfanyl-2-[(1R)-1,2,3,4-tetrahydronaphthalen-1-yl]propanamido]propanoic acid | Mercaptoacyl amino acid compound, 14b
Type:
Small organic molecule
Emp. Form.:
C24H26N2O3S
Mol. Mass.:
422.54
SMILES:
OC(=O)[C@H](Cc1c[nH]c2ccccc12)NC(=O)[C@H](CS)[C@H]1CCCc2ccccc12
:
Substrate
Name:
BDBM21631
Synonyms:
DGPA | Dansyl-Gly-(p-NO2)Phe-beta-Ala
Type:
fluorogenic substrate
Emp. Form.:
Mol. Mass.:
SMILES:
: